return and save stanza error in es

1 job for improve_error_handling in 18 minutes and 45 seconds (queued for 1 second)
Status Job ID Name Coverage
  Test
failed Test #8438
ci-test

00:18:45

 
Name Stage Failure
failed
Test Test
FAILED tests/test_creating_bounded_facts.py::test_space_between_not_ok[not_ok_spaces5]
FAILED tests/test_creating_bounded_facts.py::test_clean_similar_in_strval[similar_cleaned_str_val0-test_input0]
FAILED tests/test_creating_bounded_facts.py::test_clean_similar_in_strval[similar_cleaned_str_val1-test_input1]
FAILED tests/test_creating_bounded_facts.py::test_clean_similar_in_strval[similar_cleaned_str_val2-test_input2]
FAILED tests/test_creating_bounded_facts.py::test_clean_similar_in_strval[similar_cleaned_str_val3-test_input3]
FAILED tests/test_creating_bounded_facts.py::test_clean_similar_in_strval[similar_cleaned_str_val4-test_input4]
============ 16 failed, 95 passed, 20 warnings in 906.60s (0:15:06) ============
Cleaning up file based variables
ERROR: Job failed: exit code 1