typo fix

4 jobs for 1.11.3 in 15 minutes and 57 seconds (queued for 4 seconds)
Status Job ID Name Coverage
  Test
failed Test #8835
ci-test

00:15:57

 
  Build
skipped Build #8836
ci-test
 
  Build Worker
skipped BuildWorker #8837
docker
 
  Test Downstream
skipped TestDownstream
 
Name Stage Failure
failed
Test Test
FAILED tests/test_address_parser.py::test_address[\u0443\u043b. \u041c\u0430\u0442\u0440\u043e\u0441\u0441\u043a\u0430\u044f \u0422\u0438\u0448\u0438\u043d\u0430 , \u0434.14-\u0432 \u043d\u0430\u043f\u0440\u0430\u0432\u043b\u0435\u043d\u0438\u0438 \u043f\u043e\u0434\u043a\u043e\u043d\u0442\u0440\u043e\u043b\u044c\u043d\u043e\u0439 \u0442\u0435\u0440\u0440\u0438\u0442\u043e\u0440\u0438\u0438 \u0423\u043a\u0440\u0430\u0438\u043d\u044b \u0443\u043b. \u041c\u0430\u0442\u0440\u043e\u0441\u0441\u043a\u0430\u044f \u0422\u0438\u0448\u0438\u043d\u0430 , \u0434.14 , ]
FAILED tests/test_address_parser.py::test_address[\u0443\u043b. \u041a\u0443\u0440\u0447\u0430\u0442\u043e\u0432\u0430 10\u0430-\u0411\u043e\u0436\u044c\u0435\u0439 \u041c\u0430\u0442\u0435\u0440\u0438 \xab\u0423\u043c\u0438\u043b\u0435\u043d\u0438\u0435\xbb;- 10.00, \u0433. \u041b\u0443\u0433\u0430\u043d\u0441\u043a, \u0443\u043b. \u041a\u0443\u0440\u0447\u0430\u0442\u043e\u0432\u0430 10\u0430, \u0413\u0411\u041e\u0423 \u0421\u041f\u041e \u041b\u041d\u0420]
FAILED tests/test_address_parser.py::test_address[\u0443\u043b. \u0418\u043b\u044c\u0438\u043d\u043a\u0430 3 / 8-\u043f\u043e \u0440\u0435\u0433\u0438\u043e\u043d\u0430\u043b\u044c\u043d\u043e\u0439 \u0438 \u043c\u0435\u0436\u0434\u0443\u043d\u0430\u0440\u043e\u0434\u043d\u043e\u0439 \u0434\u0435\u044f\u0442\u0435\u043b\u044c\u043d\u043e\u0441\u0442\u0438\n\u0433. \u041c\u043e\u0441\u043a\u0432\u0430, \u0443\u043b. \u0418\u043b\u044c\u0438\u043d\u043a\u0430 3/8 \u0441\u0442\u0440\u043e\u0435\u043d\u0438\u0435 5]
FAILED tests/test_address_parser.py::test_address[\u041c\u043e\u043b\u043e\u0434\u0451\u0436\u043d\u044b\u0439 , 20-\u0430-\u0433. \u041b\u0443\u0433\u0430\u043d\u0441\u043a , \u043a\u0432. \u041c\u043e\u043b\u043e\u0434\u0451\u0436\u043d\u044b\u0439 , 20-\u0430 , \u041b\u0443\u0433\u0430\u043d\u0441\u043a\u0438\u0439 ]
FAILED tests/test_address_parser.py::test_address[\u043f\u043b. \u0413\u0435\u0440\u043e\u0435\u0432 \u0412\u041e\u0412 9-\u0447\u0435\u043b\u043e\u0432\u0435\u043a - 10.00 , \u0433. \u041b\u0443\u0433\u0430\u043d\u0441\u043a , \u043f\u043b. \u0413\u0435\u0440\u043e\u0435\u0432 \u0412\u041e\u0412 9 , 4-\u0439 \u044d\u0442\u0430\u0436 ]
FAILED tests/test_address_parser.py::test_address[\u0443\u043b. \u041e\u043a\u0442\u044f\u0431\u0440\u044c\u0441\u043a\u0430\u044f , \u0434\u043e\u043c 51-( \u0441\u0442. \u043c. \u041b\u0443\u0431\u044f\u043d\u043a\u0430 , \u0443\u043b. \u041e\u043a\u0442\u044f\u0431\u0440\u044c\u0441\u043a\u0430\u044f , \u0434\u043e\u043c 51 \u043c\u0435\u0436\u0434\u0443\u043d\u0430\u0440\u043e\u0434\u043d\u043e\u0439 \u0434\u0435\u044f\u0442\u0435\u043b\u044c\u043d\u043e\u0441\u0442\u0438)]
=========== 10 failed, 101 passed, 20 warnings in 705.15s (0:11:45) ============
Cleaning up file based variables
ERROR: Job failed: exit code 1